{"text_format":"1","workbook":"xlsx","n_sheets":13,"sheets":["基本項目","店舗一覧","販売数量","様式_販数量","様式_ニ十歳","list等","XML販数量","XMLニ十歳","利用者ファイル基本","利用者ファイル販数量","利用者ファイルニ十歳","補助機能等","保守用メモ"],"not_rendered":{"charts":0,"images":3,"macros":1,"external_links":0,"defined_names":38,"comments":5,"pivot_tables":0},"unopened":[],"bounds":{"document_bytes":16777216,"sheet_cells":100000,"rows_first":2000,"rows_last":500,"rows_between":2000,"halvings":0,"cell_chars":16384,"cell_head_chars":4096},"cells_cut":0,"cells_raw":0,"read":"whole","date_system":"1900"}

{"sheet":"基本項目","index":0,"n_rows":50,"n_cols":12,"rows_kept":50,"cut":false,"hidden":false,"merged":[[46,4,46,6],[47,4,47,6],[48,4,48,6],[49,4,49,6],[41,4,41,6],[42,4,42,6],[43,4,43,6],[44,4,44,6],[45,4,45,6],[40,9,40,11],[40,4,40,6],[36,9,36,11],[35,5,35,8],[34,10,34,11],[35,10,35,11],[38,9,38,11],[40,7,40,8],[39,4,39,8],[39,9,39,11],[37,9,37,11],[37,4,37,8],[36,4,36,8],[38,4,38,8],[19,4,19,6],[33,5,33,8],[23,2,23,3],[19,2,19,3],[27,4,27,6],[27,1,27,3],[24,2,24,3],[31,4,31,6],[20,4,20,6],[28,1,35,1],[28,4,28,6],[29,4,29,11],[30,4,30,11],[34,4,34,8],[32,4,32,6],[33,10,33,11],[7,1,7,3],[8,1,8,3],[14,1,14,3],[7,4,7,6],[8,4,8,11],[14,4,14,11],[9,1,9,3],[10,1,10,3],[11,1,11,3],[11,4,11,6],[9,4,9,11],[12,1,12,3],[13,1,13,3],[10,4,10,11],[12,4,12,11],[13,4,13,11],[3,1,3,3],[4,1,4,3],[5,1,5,3],[6,1,6,3],[6,4,6,6],[3,4,3,6],[5,4,5,6],[36,1,49,1],[41,2,49,2],[40,2,40,3],[35,2,35,3],[34,2,34,3],[36,2,39,2],[33,2,33,3],[21,2,21,3],[17,2,17,3],[18,2,18,3],[30,2,30,3],[28,2,28,3],[29,2,29,3],[20,2,20,3],[22,2,22,3],[31,2,31,3],[32,2,32,3],[20,9,21,10],[22,9,23,10],[20,11,21,11],[22,11,23,11],[15,1,15,3],[23,4,23,6],[18,4,18,6],[17,4,17,6],[17,1,24,1],[24,4,24,6],[21,4,21,6],[22,4,22,6],[15,4,15,10],[19,9,19,10],[16,1,16,3],[16,4,16,6]]}
[]
[null,"ｅ－Ｔａｘ利用者ファイル等作成ツール（Ver8.02）",null,null,null,null,null,null,null,null,"色表示部分が入力項目です"]
[]
[null,"提出年月日",null,null,{"$f":"INT(NOW())","v":"2024-02-15"}]
[null,"報告対象年度",null,null,"西暦",2023,"年度","販売数量報告\n対象期間",{"$f":"DATE(F5,4,1)","v":"2023-04-01"},{"$f":"DATE(F5+1,3,31)","v":"2024-03-31"}]
[null,"利用者識別番号"]
[null,"法人番号（My№）"]
[null,"郵便番号"]
[null,"住所又は本店所在地"]
[null,"氏名又は名称"]
[null,"氏名又は名称(全角カナ)"]
[null,"電話番号"]
[null,"代表者氏名"]
[null,"代表者氏名(全角カナ)"]
[null,"代表者住所"]
{"$rows_left_out":36}
{"sheet":"店舗一覧","index":1,"n_rows":3,"n_cols":40,"rows_kept":3,"cut":false,"hidden":false,"merged":[[1,0,2,0],[1,1,2,1]]}
[]
["店舗番号","酒類\n免許場\n整理番号","基本項目(販売場)",null,null,null,null,null,null,null,null,null,null,"酒類販売管理者関係"]
[null,null,"販売場名称","郵便番号","販売場所在地","電話番号","所轄署","店舗全体\nの面積","酒類売場\nの面積","営業時間\n区分","営業開始\n時間","営業終了\n時間","定休日","酒類販売管理者\n氏名","酒類販売管理者\n生年月日","研修受講\n年月日","販売責任者1\n氏名","\n年齢","\n基準","販売責任者2\n氏名","\n年齢","\n基準","販売責任者3\n氏名","\n年齢","\n基準","販売責任者4\n氏名","\n年齢","\n基準","販売責任者5\n氏名","\n年齢","\n基準","販売責任者6\n氏名","\n年齢","\n基準","販売責任者7\n氏名","\n年齢","\n基準","販売責任者8\n氏名","\n年齢","\n基準"]

{"sheet":"販売数量","index":2,"n_rows":3,"n_cols":6,"rows_kept":3,"cut":false,"hidden":false,"merged":[]}
[null,null,"全店舗分販売数量データ"]
[]
["店舗番号","酒類","卸売業者(ℓ)","小売業者(ℓ)","小売数量(ℓ)","在庫数量(ℓ)"]

{"sheet":"様式_販数量","index":3,"n_rows":49,"n_cols":7,"rows_kept":49,"cut":false,"hidden":false,"merged":[[41,5,41,6],[43,4,44,4],[41,0,44,3],[8,3,8,6],[4,3,4,6],[9,3,9,4],[5,3,5,6],[15,5,17,5],[15,3,15,4],[14,0,14,6],[33,1,33,2],[38,0,38,2],[39,0,39,2],[39,3,39,6],[38,3,38,6],[36,0,36,2],[15,0,17,2],[10,0,12,2],[23,1,23,2],[22,1,22,2],[13,0,13,6],[16,3,16,4],[11,3,11,5],[15,6,17,6],[10,3,10,5],[11,6,12,6],[18,1,18,2],[21,1,21,2],[20,1,20,2],[19,1,19,2],[37,0,37,6],[35,0,35,2],[28,1,28,2],[27,1,27,2],[0,0,0,6],[6,3,6,6],[1,0,1,6],[2,0,2,6],[4,0,4,1],[4,2,9,2],[9,0,9,1],[7,3,7,6],[8,0,8,1],[12,3,12,5],[32,1,32,2],[31,1,31,2],[34,0,34,2],[26,1,26,2],[25,1,25,2],[24,1,24,2],[30,1,30,2],[29,1,29,2]]}
["CC1-5604"]
["酒　類　の　販　売　数　量　等　報　告　書"]
[{"$f":"DBCS(\"(\"&TEXT(報告期間自,\"gggge年m月d日\")&\"～\"&TEXT(報告期間至,\"gggge年m月d日\")&\")\")","v":"（令和５年４月１日～令和６年３月３１日）"}]
[null,null,null,null,null,"酒類免許場\n整理番号",{"$f":"基本項目!$E$28","v":{"$error":"#N/A"}}]
[{"$f":"基本項目!$E$4","v":"2024-02-15"},null,"報\n\n告\n\n者",{"$f":"\"（住所）〒\"&DBCS(基本項目!$E$8)","v":"（住所）〒"}]
[null,null,null,{"$f":"基本項目!$E$9","v":0}]
[null,null,null,"（氏名又は名称及び代表者氏名）"]
[null,null,null,{"$f":"基本項目!$E$10","v":0}]
[null,null,null,{"$f":"IF(基本項目!$E$13=\"\",\"\",基本項目!$E$13)","v":""}]
[{"$f":"基本項目!$E$33&\" 税務署長  殿\"","v":{"$error":"#N/A"}},null,null,{"$f":"CONCATENATE(\"（電話）　\",DBCS(基本項目!$E$12))","v":"（電話）　"},null,"（法人番号）\n個人の方は、個人番号の記載は不要です。",{"$f":"DBCS(基本項目!$E$7)","v":""}]
["販売場の所在地及び名称",null,null,{"$f":"\"〒\"&DBCS(基本項目!$E$29)","v":{"$error":"#N/A"}},null,null,"（電話）"]
[null,null,null,{"$f":"基本項目!$E$30","v":{"$error":"#N/A"}},null,null,{"$f":"DBCS(基本項目!$E$32)","v":{"$error":"#N/A"}}]
[null,null,null,{"$f":"基本項目!$E$31","v":{"$error":"#N/A"}}]
["　酒税法第４７条第４項の規定により下記のとおり報告します。"]
["記"]
{"$rows_left_out":35}
{"sheet":"様式_ニ十歳","index":4,"n_rows":129,"n_cols":28,"rows_kept":129,"cut":false,"hidden":false,"merged":[[6,7,6,23],[93,2,93,23],[20,18,20,20],[38,8,38,15],[39,3,39,17],[39,18,39,20],[77,18,77,20],[78,22,78,23],[23,18,23,20],[40,22,40,23],[35,18,38,20],[24,2,24,17],[28,3,28,17],[27,22,27,23],[29,18,29,20],[30,2,30,17],[35,22,38,23],[37,5,37,7],[38,5,38,7],[70,0,70,17],[44,1,44,22],[43,0,43,23],[60,10,60,14],[35,21,38,21],[86,21,86,23],[113,12,113,14],[111,18,111,20],[111,12,111,14],[111,15,111,17],[41,18,41,20],[95,0,95,1],[82,2,82,8],[82,9,82,10],[82,11,82,13],[82,14,82,18],[82,19,82,20],[108,15,108,17],[84,19,84,20],[86,9,86,10],[86,11,86,13],[86,19,86,20],[61,16,61,23],[73,0,74,1],[75,0,78,1],[70,18,70,20],[65,3,65,9],[65,10,65,14],[109,9,109,11],[8,0,8,5],[3,6,10,6],[20,21,20,23],[42,3,42,17],[28,18,28,20],[18,0,18,23],[27,18,27,20],[27,3,27,17],[20,0,20,17],[23,22,23,23],[42,22,42,23],[12,19,12,20],[12,22,12,23],[28,22,28,23],[11,16,11,23],[39,22,39,23],[40,3,40,17],[40,18,40,20],[35,0,42,1],[9,5,10,5],[6,5,7,5],[29,4,29,17],[34,0,34,23],[22,22,22,23],[0,0,0,6],[1,0,1,23],[10,7,10,23],[80,13,80,14],[5,7,5,23],[3,21,3,23],[13,16,13,17],[2,18,2,19],[2,20,2,23],[37,14,37,15],[9,7,9,23],[8,7,8,23],[4,21,4,23],[37,8,37,13],[3,7,3,20],[4,7,4,20],[7,7,7,23],[3,0,3,5],[77,3,77,17],[4,0,4,5],[5,0,5,5],[6,0,7,4],[9,0,10,4],[65,16,65,23],[125,1,125,2],[76,3,76,17],[72,18,72,20],[77,22,77,23],[110,15,110,17],[110,18,110,20],[112,15,112,17],[112,18,112,20],[111,9,111,11],[119,2,119,8],[113,2,113,8],[114,2,114,8],[117,2,118,8],[116,15,116,17],[118,9,118,12],[113,18,113,20],[111,2,111,8],[106,12,106,14],[115,15,115,17],[113,15,113,17],[80,2,80,12],[73,3,73,17],[73,18,73,20],[79,2,79,17],[109,12,109,14],[119,22,120,23],[115,12,115,14],[122,9,122,11],[122,12,122,14],[117,21,118,21],[121,22,121,23],[121,0,121,8],[115,18,115,20],[116,18,116,20],[118,13,118,20],[116,2,116,8],[122,0,122,8],[121,9,121,11],[120,9,120,11],[115,22,118,23],[110,0,114,1],[115,0,118,1],[120,18,120,20],[114,18,114,20],[119,0,120,1],[119,18,119,20],[122,15,122,17],[84,2,84,8],[84,9,84,10],[129,2,129,23],[122,18,122,20],[121,18,121,20],[94,2,94,23],[95,2,95,23],[96,1,96,22],[97,2,97,22],[102,2,102,22],[103,2,103,22],[125,3,125,23],[128,3,128,23],[121,15,121,17],[121,12,121,14],[114,15,114,17],[107,22,107,23],[114,22,114,23],[120,2,120,8],[107,0,107,8],[108,18,108,20],[111,22,111,23],[110,9,110,11],[110,12,110,14],[130,2,130,23],[126,2,126,23],[85,14,85,18],[85,19,85,20],[85,21,85,23],[86,2,86,8],[87,0,87,23],[106,0,106,8],[110,2,110,8],[85,2,85,8],[85,9,85,10],[85,11,85,13],[112,22,112,23],[113,22,113,23],[112,9,112,11],[112,12,112,14],[114,12,114,14],[93,0,93,1],[88,0,88,1],[89,0,89,1],[90,0,90,1],[110,22,110,23],[108,22,108,23],[109,22,109,23],[108,0,108,8],[108,9,108,11],[109,0,109,8],[109,15,109,17],[109,18,109,20],[108,12,108,14],[84,11,84,13],[84,14,84,18],[63,10,63,14],[64,10,64,14],[64,16,64,23],[71,18,71,20],[78,3,78,17],[78,18,78,20],[71,3,71,17],[74,3,74,17],[72,3,72,17],[74,18,74,20],[75,3,75,17],[75,18,75,20],[83,21,83,23],[70,21,70,23],[83,14,83,18],[72,22,72,23],[79,0,79,1],[80,0,86,1],[107,12,107,14],[107,15,107,17],[107,18,107,20],[106,9,106,11],[106,15,106,17],[106,18,106,20],[73,22,73,23],[79,22,79,23],[76,18,76,20],[74,22,74,23],[75,22,75,23],[76,22,76,23],[86,14,86,18],[106,21,106,23],[107,9,107,11],[94,0,94,1],[79,18,79,20],[83,19,83,20],[83,2,83,8],[83,9,83,10],[83,11,83,13],[82,21,82,23],[24,21,26,21],[24,22,26,23],[21,22,21,23],[71,0,72,1],[63,16,63,23],[66,2,66,9],[66,16,66,23],[62,2,62,9],[61,10,61,14],[22,2,23,2],[21,3,21,17],[41,3,41,17],[22,4,22,17],[23,4,23,17],[31,4,31,17],[30,22,31,23],[59,16,59,23],[71,22,71,23],[35,3,35,17],[29,22,29,23],[42,18,42,20],[41,22,41,23],[62,10,62,14],[66,10,66,14],[33,6,33,9],[33,10,33,17],[60,2,60,9],[62,16,62,23],[60,16,60,23],[64,2,64,9],[61,3,61,9],[63,3,63,9],[67,10,67,14],[67,2,67,9],[67,16,67,23],[36,4,36,17],[17,1,17,12],[128,1,128,2],[124,2,124,23],[113,9,113,11],[114,9,114,11],[115,9,115,11],[115,2,115,8],[122,22,122,23],[120,12,120,14],[120,15,120,17],[119,9,119,11],[119,12,119,14],[119,15,119,17],[127,2,127,23],[59,0,67,1],[58,1,58,22],[59,2,59,9],[59,10,59,14],[21,0,31,1],[30,18,31,20],[30,21,31,21],[33,0,33,5],[33,18,33,20],[33,21,33,23],[92,0,92,1],[112,2,112,8],[117,9,117,20],[116,9,116,11],[116,12,116,14],[2,15,2,17],[2,13,2,14],[2,10,2,12],[26,5,26,17],[25,5,25,17],[24,18,26,20],[21,18,21,20],[22,18,22,20],[12,16,12,18],[13,18,13,22],[13,12,13,15],[13,7,13,10],[12,1,12,15],[11,0,11,15],[14,0,14,23],[13,1,13,6],[15,1,15,23],[16,1,16,23],[17,13,17,15],[84,21,84,23],[19,0,19,23],[99,2,99,22],[100,2,100,22],[101,2,101,22],[98,2,98,22],[54,1,54,22],[55,1,55,22],[56,1,56,22],[57,1,57,22],[45,1,45,22],[46,1,46,22],[47,1,47,22],[48,1,48,22],[49,1,49,22],[50,1,50,22],[51,1,51,22],[53,1,53,22],[88,2,88,23],[89,2,89,23],[90,2,90,23],[91,2,91,23],[92,2,92,23],[91,0,91,1]]}
["CC1-3007"]
["「二十歳未満の者の飲酒防止に関する表示基準」の実施状況等報告書"]
[null,null,null,null,null,null,null,null,null,null,"※税務署整理欄",null,null,"局署番号",null,{"$f":"基本項目!I33","v":{"$error":"#N/A"}},null,null,"整理番号",null,{"$f":"基本項目!$E$28","v":{"$error":"#N/A"}}]
[{"$f":"基本項目!$E$4","v":"2024-02-15"},null,null,null,null,null,"報　　告　　者",{"$f":"\"（住所）〒\"&DBCS(基本項目!$E$8)","v":"（住所）〒"},null,null,null,null,null,null,null,null,null,null,null,null,null,"（電話）"]
[{"$f":"基本項目!$E$33&\" 税務署長  殿\"","v":{"$error":"#N/A"}},null,null,null,null,null,null,{"$f":"基本項目!$E$9","v":0},null,null,null,null,null,null,null,null,null,null,null,null,null,{"$f":"基本項目!E12","v":0}]
["101（店舗全体の面積）",null,null,null,null,null,null,"（氏名又は名称及び代表者氏名）"]
[{"$f":"ROUND(基本項目!$F$34,2)","v":{"$error":"#N/A"}},null,null,null,null,"㎡",null,{"$f":"基本項目!$E$10","v":0}]
[null,null,null,null,null,null,null,{"$f":"IF(基本項目!$E$13=\"\",\"\",基本項目!$E$13)","v":""}]
["102（酒類売場の面積）",null,null,null,null,null,null,"（酒類小売販売場の所在地及び名称）"]
[{"$f":"ROUND(基本項目!$K$34,2)","v":{"$error":"#N/A"}},null,null,null,null,"㎡",null,{"$f":"基本項目!$E$30","v":{"$error":"#N/A"}}]
[null,null,null,null,null,null,null,{"$f":"基本項目!$E$31","v":{"$error":"#N/A"}}]
["103（免許条件）",null,null,null,null,null,null,null,null,null,null,null,null,null,null,null,"104（営業時間）(注)24時間表記で記載してください。"]
[null,"小売業（卸小売兼業を含む）",null,null,null,null,null,null,null,null,null,null,null,null,null,null,{"$f":"基本項目!$E$35","v":{"$error":"#N/A"}},null,null,{"$f":"IF(Q13=\"24時間\",0,基本項目!$F$36)","v":{"$error":"#N/A"}},null,"～",{"$f":"IF(Q13=\"24時間\",0,基本項目!$K$36)","v":{"$error":"#N/A"}},null,{"$f":"IF(B13=\"\",0,VLOOKUP(B13,list等!E40:F42,2,FALSE))","v":2}]
[null,"期限付小売業の\n場合の免許期間",null,null,null,null,null,"00:00:00",null,null,null,"～","00:00:00",null,null,null,"（定休日:",null,{"$f":"基本項目!$K$35","v":{"$error":"#N/A"}},null,null,null,null,"）",{"$f":"IF(Q13=\"\",0,VLOOKUP(Q13,list等!E35:F37,2,FALSE))","v":{"$error":"#N/A"}}]
["105（酒類小売販売場の業態等の区分）"]
{"$rows_left_out":115}
{"sheet":"list等","index":5,"n_rows":525,"n_cols":9,"rows_kept":525,"cut":false,"hidden":true,"merged":[]}
["税務署名","番号","都道府県",null,"業態区分","番号",null,"販売数量条件式"]
["麹町","01101","東京都",null,"１：一般酒販店(酒屋、酒類専門店等)",1,null,"店舗番号","酒類"]
["神田","01103","東京都",null,"２：コンビニエンスストア",2,null,{"$f":"基本項目!$L$20","v":0},"清酒"]
["日本橋","01105","東京都",null,"３：スーパーマーケット",3,null,"店舗番号","酒類"]
["京橋","01107","東京都",null,"４：百貨店",4,null,{"$f":"基本項目!$L$20","v":0},"合成清酒"]
["芝","01109","東京都",null,"５：１～４以外の量販店(ディスカウントストア等)",5,null,"店舗番号","酒類"]
["四谷","01111","東京都",null,"６A：業務用卸主体店",6,null,{"$f":"基本項目!$L$20","v":0},"連続式蒸留焼酎"]
["麻布","01113","東京都",null,"６B：ホームセンター・ドラッグストア",7,null,"店舗番号","酒類"]
["小石川","01115","東京都",null,"６C：その他(生活協同組合、農業協同組合、ギフトショップ、ピザ宅配店、弁当・惣菜店、果物店、生花店、菓子店等)",8,null,{"$f":"基本項目!$L$20","v":0},"単式蒸留焼酎"]
["本郷","01117","東京都",null,null,null,null,"店舗番号","酒類"]
["東京上野","01119","東京都",null,null,null,null,{"$f":"基本項目!$L$20","v":0},"みりん"]
["浅草","01121","東京都",null,"酒類区分",null,null,"店舗番号","酒類"]
["品川","01123","東京都",null,"清酒",null,null,{"$f":"基本項目!$L$20","v":0},"ビール"]
["荏原","01125","東京都",null,"合成清酒",null,null,"店舗番号","酒類"]
["大森","01127","東京都",null,"連続式蒸留焼酎",null,null,{"$f":"基本項目!$L$20","v":0},"果実酒"]
{"$rows_left_out":511}
{"sheet":"XML販数量","index":6,"n_rows":224,"n_cols":3,"rows_kept":224,"cut":false,"hidden":true,"merged":[]}
["組み込み用ファイルデータ部","利用者ファイル編集用（＜＞の編集）","備考"]
[null,"<param name=\"帳票データ\">"]
[null,"&lt;reportValue reportId=&quot;LIY150&quot; reportName=&quot;酒類の販売数量等報告書&quot; leafId=&quot;&quot;&gt;&lt;page reportId=&quot;LIY150&quot; reportName=&quot;酒類の販売数量等報告書&quot; status=&quot;0&quot;&gt;"]
["<GOA00000>",{"$f":"SUBSTITUTE(SUBSTITUTE(SUBSTITUTE(A4,\"<\",\"&amp;lt;\"),\">\",\"&amp;gt;\"),\"\"\"\",\"&amp;quot;\")","v":"&amp;lt;GOA00000&amp;gt;"}]
[{"$f":"IF(報告年度=\"\",\"\",\"<GOA00010>\")","v":"<GOA00010>"},{"$f":"SUBSTITUTE(SUBSTITUTE(SUBSTITUTE(A5,\"<\",\"&amp;lt;\"),\">\",\"&amp;gt;\"),\"\"\"\",\"&amp;quot;\")","v":"&amp;lt;GOA00010&amp;gt;"}]
[{"$f":"IF(報告年度=\"\",\"\",\"<gen:era>\"&VLOOKUP(TEXT(報告期間自,\"gggg\"),元号ＴＢ,2,FALSE) &\"</gen:era>\")","v":"<gen:era>5</gen:era>"},"&amp;lt;gen:era&amp;gt;5&amp;lt;/gen:era&amp;gt;","報告対象年度自"]
[{"$f":"IF(報告年度=\"\",\"\",\"<gen:yy>\"&TEXT(報告期間自,\"e\")&\"</gen:yy>\")","v":"<gen:yy>5</gen:yy>"},"&amp;lt;gen:yy&amp;gt;5&amp;lt;/gen:yy&amp;gt;"]
[{"$f":"IF(報告年度=\"\",\"\",\"</GOA00010>\")","v":"</GOA00010>"},"&amp;lt;/GOA00010&amp;gt;"]
[{"$f":"IF(報告年度=\"\",\"\",\"<GOA00020>\")","v":"<GOA00020>"},"&amp;lt;GOA00020&amp;gt;","報告対象年度至"]
[{"$f":"IF(報告年度=\"\",\"\",\"<gen:era>\"&VLOOKUP(TEXT(報告期間至,\"gggg\"),元号ＴＢ,2,FALSE) &\"</gen:era>\")","v":"<gen:era>5</gen:era>"},{"$f":"SUBSTITUTE(SUBSTITUTE(SUBSTITUTE(A10,\"<\",\"&amp;lt;\"),\">\",\"&amp;gt;\"),\"\"\"\",\"&amp;quot;\")","v":"&amp;lt;gen:era&amp;gt;5&amp;lt;/gen:era&amp;gt;"},"報告対象年度至"]
[{"$f":"IF(報告年度=\"\",\"\",\"<gen:yy>\"&TEXT(報告期間至,\"e\")&\"</gen:yy>\")","v":"<gen:yy>6</gen:yy>"},{"$f":"SUBSTITUTE(SUBSTITUTE(SUBSTITUTE(A11,\"<\",\"&amp;lt;\"),\">\",\"&amp;gt;\"),\"\"\"\",\"&amp;quot;\")","v":"&amp;lt;gen:yy&amp;gt;6&amp;lt;/gen:yy&amp;gt;"},"報告対象年度至"]
[{"$f":"IF(報告年度=\"\",\"\",\"</GOA00020>\")","v":"</GOA00020>"},{"$f":"SUBSTITUTE(SUBSTITUTE(SUBSTITUTE(A12,\"<\",\"&amp;lt;\"),\">\",\"&amp;gt;\"),\"\"\"\",\"&amp;quot;\")","v":"&amp;lt;/GOA00020&amp;gt;"},"報告対象年度至"]
["</GOA00000>","&amp;lt;/GOA00000&amp;gt;"]
["<GOB00000>",{"$f":"SUBSTITUTE(SUBSTITUTE(SUBSTITUTE(A14,\"<\",\"&amp;lt;\"),\">\",\"&amp;gt;\"),\"\"\"\",\"&amp;quot;\")","v":"&amp;lt;GOB00000&amp;gt;"}]
[{"$f":"IF(様式_販数量!$G$4>0,\"<GOB00005>\"&様式_販数量!$G$4&\"</GOB00005>\",\"\")","v":{"$error":"#N/A"}},{"$f":"SUBSTITUTE(SUBSTITUTE(SUBSTITUTE(A15,\"<\",\"&amp;lt;\"),\">\",\"&amp;gt;\"),\"\"\"\",\"&amp;quot;\")","v":{"$error":"#N/A"}}]
{"$rows_left_out":210}
{"sheet":"XMLニ十歳","index":7,"n_rows":504,"n_cols":3,"rows_kept":504,"cut":false,"hidden":true,"merged":[]}
["組み込み用ファイルデータ部","利用者ファイル編集用（＜＞の編集）","備考"]
[{"$f":"\"<LIZ140 VR=\"\"6.0\"\" id=\"\"LIZ140-1\"\" page=\"\"1\"\" sakuseiDay=\"\"\"&TEXT(NOW(),\"yyyy-mm-dd\")&\"\"\" sakuseiNM=\"\"\" & 基本項目!$E$10 & \"\"\" softNM=\"\"ntaclient\"\">\"","v":"<LIZ140 VR=\"6.0\" id=\"LIZ140-1\" page=\"1\" sakuseiDay=\"2024-02-15\" sakuseiNM=\"\" softNM=\"ntaclient\">"},null,"作成日、データ作成者"]
[null,"<param name=\"帳票データ\">"]
[null,"&lt;reportValue reportId=&quot;LIZ140&quot; reportName=&quot;「ニ十歳未満の者の飲酒防止に関する表示基準」の実施状況等報告書　1面&quot; leafId=&quot;&quot;&gt;&lt;page reportId=&quot;LIZ140&quot; reportName=&quot;「ニ十歳未満の者の飲酒防止に関する表示基準」の実施状況等報告書　1面&quot; status=&quot;0&quot;&gt;"]
["<IHA00000>",{"$f":"IF(LEFT(A5,4)=\"<!--\",\"\",SUBSTITUTE(SUBSTITUTE(SUBSTITUTE(A5,\"<\",\"&amp;lt;\"),\">\",\"&amp;gt;\"),\"\"\"\",\"&amp;quot;\"))","v":"&amp;lt;IHA00000&amp;gt;"}]
[{"$f":"IF(様式_ニ十歳!U3=\"\",\"\",\"<IHA00005>\"&ASC(様式_ニ十歳!U3) &\"</IHA00005>\")","v":{"$error":"#N/A"}},{"$error":"#N/A"},"整理番号"]
["<IHA00010 IDREF=\"TEISYUTSU_DAY\"/>","&amp;lt;IHA00010 IDREF=&amp;quot;TEISYUTSU_DAY&amp;quot;/&amp;gt;"]
["<IHA00020 IDREF=\"ZEIMUSHO\"/>","&amp;lt;IHA00020 IDREF=&amp;quot;ZEIMUSHO&amp;quot;/&amp;gt;"]
["<IHA00030>","&amp;lt;IHA00030&amp;gt;"]
["<IHA00040 IDREF=\"NOZEISHA_ZIP\"/>","&amp;lt;IHA00040 IDREF=&amp;quot;NOZEISHA_ZIP&amp;quot;/&amp;gt;"]
["<IHA00050 IDREF=\"NOZEISHA_ADR\"/>","&amp;lt;IHA00050 IDREF=&amp;quot;NOZEISHA_ADR&amp;quot;/&amp;gt;"]
["<IHA00060 IDREF=\"NOZEISHA_TEL\"/>","&amp;lt;IHA00060 IDREF=&amp;quot;NOZEISHA_TEL&amp;quot;/&amp;gt;"]
["<IHA00070>","&amp;lt;IHA00070&amp;gt;"]
["<IHA00080 IDREF=\"NOZEISHA_NM\"/>","&amp;lt;IHA00080 IDREF=&amp;quot;NOZEISHA_NM&amp;quot;/&amp;gt;"]
["<IHA00090 IDREF=\"DAIHYO_NM\"/>","&amp;lt;IHA00090 IDREF=&amp;quot;DAIHYO_NM&amp;quot;/&amp;gt;"]
{"$rows_left_out":490}
{"sheet":"利用者ファイル基本","index":8,"n_rows":30,"n_cols":2,"rows_kept":30,"cut":false,"hidden":true,"merged":[]}
["備考","利用者ファイル内容（共通）"]
["ヘッダー部分","<?xml version=\"1.0\" encoding=\"UTF-8\"?>"]
[null,"<itemclass name=\"キャビネット\" progId=\"nta.CLCCabinet.1\">"]
[null,"<param name=\"リビジョン\">2.10.0.0</param>"]
[null,"<param name=\"申告等管理\">"]
[null,"<container name=\"申告等管理\" progId=\"nta.CLCStatementManager.1\">"]
[]
["データ部分","ヘッダーとフッターの間に個々の販売数量等のデータを挿入する。"]
[]
["フッター部分","</container>"]
[null,"</param>"]
[null,"<param name=\"納税者等情報\">"]
[null,"<itemclass name=\"納税者等情報\" progId=\"nta.CLCProfile.1\">"]
[null,"<param name=\"納税者等情報内容部\">"]
[null,"<itemclass name=\"納税者等情報内容部\" progId=\"nta.CLCProfileContent.1\">"]
{"$rows_left_out":16}
{"sheet":"利用者ファイル販数量","index":9,"n_rows":111,"n_cols":2,"rows_kept":111,"cut":false,"hidden":true,"merged":[]}
["備考","利用者ファイル内容（個別）"]
["e-Taxソフトの申告･申請名称⇒「販売数量等報告(●●)」(●●は店舗番号を設定）",{"$f":"\"<item filename=\"\"\"\" key=\"\"\"\" keysave=\"\"true\"\" mode=\"\"0\"\" name=\"\"(\"&基本項目!L20&\")数量報告\"\"><itemclass name=\"\"申告等\"\" progId=\"\"nta.CLCStatement.1\"\">\"","v":"<item filename=\"\" key=\"\" keysave=\"true\" mode=\"0\" name=\"()数量報告\"><itemclass name=\"申告等\" progId=\"nta.CLCStatement.1\">"}]
[null,"<param name=\"IT部更新フラグ\">0</param>"]
[null,"<param name=\"スキーマファイル\">shuzei\\PLI0510-170.xsd</param>"]
[null,"<param name=\"ネームスペース\">http://xml.e-tax.nta.go.jp/XSD/shuzei</param>"]
[null,"<param name=\"バージョン\">170.1</param>"]
[null,"<param name=\"検証スクリプトファイル名\">CMPLI0510-170.xfc</param>"]
["当該処理時刻を設定",{"$f":"\"<param name=\"\"更新日時\"\">\"& TEXT(NOW(),\"yyyy-mm-dd hh:mm:ss\")&\"</param>\"","v":"<param name=\"更新日時\">2024-02-15 13:46:45</param>"}]
["販売業者名を設定",{"$f":"\"<param name=\"\"作成者\"\">\"&基本項目!$E$10&\"</param>\"","v":"<param name=\"作成者\"></param>"}]
["当該処理時刻を設定",{"$f":"\"<param name=\"\"作成日時\"\">\"& TEXT(NOW(),\"yyyy-mm-dd hh:mm:ss\")&\"</param>\"","v":"<param name=\"作成日時\">2024-02-15 13:46:45</param>"}]
[null,"<param name=\"手続きID\">PLI0510</param>"]
[null,"<param name=\"手続き内帳票一覧ファイル名\">CLPLI-170.ncs</param>"]
[null,"<param name=\"手続き名\">酒類の販売数量等報告</param>"]
[null,"<param name=\"署名管理\"><container name=\"署名管理\" progId=\"nta.CLCSignatureManager.1\"/>"]
[null,"</param>"]
{"$rows_left_out":97}
{"sheet":"利用者ファイルニ十歳","index":10,"n_rows":227,"n_cols":2,"rows_kept":227,"cut":false,"hidden":true,"merged":[]}
["備考","利用者ファイル内容（個別）"]
["e-Taxソフトの申告･申請名称⇒「二十歳未満の者の飲酒防止等報告書(●●)」(●●は店舗番号を設定）",{"$f":"\"<item filename=\"\"\"\" key=\"\"\"\" keysave=\"\"false\"\" mode=\"\"0\"\" name=\"\"(\"&基本項目!L20&\")二十歳報告\"\"><itemclass name=\"\"申告等\"\" progId=\"\"nta.CLCStatement.1\"\">\"","v":"<item filename=\"\" key=\"\" keysave=\"false\" mode=\"0\" name=\"()二十歳報告\"><itemclass name=\"申告等\" progId=\"nta.CLCStatement.1\">"}]
[null,"<param name=\"IT部更新フラグ\">0</param>"]
[null,"<param name=\"スキーマファイル\">shuzei\\PLI0890-200.xsd</param>"]
[null,"<param name=\"ネームスペース\">http://xml.e-tax.nta.go.jp/XSD/shuzei</param>"]
[null,"<param name=\"バージョン\">200.0</param>"]
[null,"<param name=\"検証スクリプトファイル名\">CMPLI0890-200.xfc</param>"]
["当該処理時刻を設定",{"$f":"\"<param name=\"\"更新日時\"\">\"& TEXT(NOW(),\"yyyy-mm-dd hh:mm:ss\")&\"</param>\"","v":"<param name=\"更新日時\">2024-02-15 13:46:45</param>"}]
["販売業者名を設定",{"$f":"\"<param name=\"\"作成者\"\">\"&基本項目!$E$10&\"</param>\"","v":"<param name=\"作成者\"></param>"}]
["当該処理時刻を設定",{"$f":"\"<param name=\"\"作成日時\"\">\"& TEXT(NOW(),\"yyyy-mm-dd hh:mm:ss\")&\"</param>\"","v":"<param name=\"作成日時\">2024-02-15 13:46:45</param>"}]
[null,"<param name=\"手続きID\">PLI0890</param>"]
[null,"<param name=\"手続き内帳票一覧ファイル名\">CLPLI-200.ncs</param>"]
[null,"<param name=\"手続き名\">二十歳未満の者のの飲酒防止に関する表示基準の実施状況等報告</param>"]
[null,"<param name=\"署名管理\"><container name=\"署名管理\" progId=\"nta.CLCSignatureManager.1\"/>"]
[null,"</param>"]
{"$rows_left_out":213}
{"sheet":"補助機能等","index":11,"n_rows":30,"n_cols":3,"rows_kept":30,"cut":false,"hidden":false,"merged":[]}
["　【一括印刷機能】"]
[]
[]
[]
[]
[]
[]
["【酒類区分補正処理】"]
["　社内システムの酒類区分名を、当該ツールで使用する酒類区分名に置換します。"]
["　以下の表に社内システムで使用している酒類区分名を入力し、置換ボタンをクリックしてください。"]
["　（黄色の部分が入力部分です。青色部分は当該ツールで使用している酒類区分名です。）"]
[]
[null,"変更前＿酒類区分","変更後　酒類区分"]
[null,"清酒","清酒"]
[null,"合成清酒","合成清酒"]
{"$rows_left_out":16}
{"sheet":"保守用メモ","index":12,"n_rows":4,"n_cols":3,"rows_kept":4,"cut":false,"hidden":true,"merged":[]}
["利用者ファイルの帳票データ部分の解析は”&amp\"等を読み替えるため、次の計算式を用いる。"]
["元データ","計算式"]
["<param name=\"帳票データ\">&lt;reportValue reportId=&quot;LIZ141&quot; reportName=&quot;「ニ十歳未満の者の飲酒防止に関する表示基準」の実施状況等報告書　2面&quot; leafId=&quot;&quot;&gt;&lt;page reportId=&quot;LIZ141&quot; reportName=&quot;「ニ十歳未満の者の飲酒防止に関する表示基準」の実施状況等報告書　2面&quot; status=&quot;0&quot;&gt;&amp;lt;IIG00000&amp;gt;&amp;lt;IIG00030&amp;gt;管理者&amp;lt;/IIG00030&amp;gt;&amp;lt;IIG00040&amp;gt;30&amp;lt;/IIG00040&amp;gt;&amp;lt;IIG00050&amp;gt;&amp;lt;gen:era&amp;gt;5&amp;lt;/gen:era&amp;gt;&amp;lt;gen:yy&amp;gt;4&amp;lt;/gen:yy&amp;gt;&amp;lt;gen:mm&amp;gt;1&amp;lt;/gen:mm&amp;gt;&amp;lt;gen:dd&amp;gt;1&amp;lt;/gen:dd&amp;gt;&amp;lt;/IIG00050&amp;gt;&amp;lt;IIG00060&amp;gt;&amp;lt;kubun_CD&amp;gt;1&amp;lt;/kubun_CD&amp;gt;&amp;lt;/IIG00060&amp;gt;&amp;lt;IIG00070&amp;gt;&amp;lt;kubun_CD&amp;gt;1&amp;lt;/kubun_CD&amp;gt;&amp;lt;/IIG00070&amp;gt;&amp;lt;IIG00080&amp;gt;&amp;lt;kubun_CD&amp;gt;1&amp;lt;/kubun_CD&amp;gt;&amp;lt;/IIG00080&amp;gt;&amp;lt;IIG00010&amp;gt;&amp;lt;kubun_CD&amp;gt;1&amp;lt;/kubun_CD&amp;gt;&amp;lt;/IIG00010&amp;gt;&amp;lt;IIG00020&amp;gt;&amp;lt;kubun_CD&amp;gt;1&amp;lt;/kubun_CD&amp;gt;&amp;lt;/IIG00020&amp;gt;&amp;lt;/IIG00000&amp;gt;&amp;lt;IIK00000&amp;gt;&amp;lt;IIK00010&amp;gt;10&amp;lt;/IIK00010&amp;gt;&amp;lt;IIK00020&amp;gt;10000000&amp;lt;/IIK00020&amp;gt;&amp;lt;IIK00030&amp;gt;9000000&amp;lt;/IIK00030&amp;gt;&amp;lt;IIK00040&amp;gt;8000000&amp;lt;/IIK00040&amp;gt;&amp;lt;IIK00050&amp;gt;7000000&amp;lt;/IIK00050&amp;gt;&amp;lt;IIK00060&amp;gt;6000000&amp;lt;/IIK00060&amp;gt;&amp;lt;IIK00065&amp;gt;5000000&amp;lt;/IIK00065&amp;gt;&amp;lt;IIK00070&amp;gt;4000000&amp;lt;/IIK00070&amp;gt;&amp;lt;IIK00080&amp;gt;1000000&amp;lt;/IIK00080&amp;gt;&amp;lt;/IIK00000&amp;gt;&lt;/page&gt;&lt;/reportValue&gt;</param>",{"$f":"SUBSTITUTE(SUBSTITUTE(SUBSTITUTE(SUBSTITUTE(SUBSTITUTE(SUBSTITUTE(SUBSTITUTE(A3,\"&amp;lt;\",\"<\"),\"&amp;gt;\",\">\"),\"&amp;quot;\",\"\"\"\"),\"&gt;\",\">\"),\"&lt;\",\"<\"),\"&quot;\",\"\"\"\"),\"><\",\">\"&CHAR(10)&\"<\")","v":"<param name=\"帳票データ\">\n<reportValue reportId=\"LIZ141\" reportName=\"「ニ十歳未満の者の飲酒防止に関する表示基準」の実施状況等報告書　2面\" leafId=\"\">\n<page reportId=\"LIZ141\" reportName=\"「ニ十歳未満の者の飲酒防止に関する表示基準」の実施状況等報告書　2面\" status=\"0\">\n<IIG00000>\n<IIG00030>管理者</IIG00030>\n<IIG00040>30</IIG00040>\n<IIG00050>\n<gen:era>5</gen:era>\n<gen:yy>4</gen:yy>\n<gen:mm>1</gen:mm>\n<gen:dd>1</gen:dd>\n</IIG00050>\n<IIG00060>\n<kubun_CD>1</kubun_CD>\n</IIG00060>\n<IIG00070>\n<kubun_CD>1</kubun_CD>\n</IIG00070>\n<IIG00080>\n<kubun_CD>1</kubun_CD>\n</IIG00080>\n<IIG00010>\n<kubun_CD>1</kubun_CD>\n</IIG00010>\n<IIG00020>\n<kubun_CD>1</kubun_CD>\n</IIG00020>\n</IIG00000>\n<IIK00000>\n<IIK00010>10</IIK00010>\n<IIK00020>10000000</IIK00020>\n<IIK00030>9000000</IIK00030>\n<IIK00040>8000000</IIK00040>\n<IIK00050>7000000</IIK00050>\n<IIK00060>6000000</IIK00060>\n<IIK00065>5000000</IIK00065>\n<IIK00070>4000000</IIK00070>\n<IIK00080>1000000</IIK00080>\n</IIK00000>\n</page>\n</reportValue>\n</param>"},"やりすぎ変換"]
[null,{"$f":"SUBSTITUTE(SUBSTITUTE(SUBSTITUTE(SUBSTITUTE(A4,\"&amp;lt;\",\"<\"),\"&amp;gt;\",\">\"),\"&amp;quot;\",\"\"\"\"),\"><\",\">\"&CHAR(10)&\"<\")","v":""}]